Build failed in Jenkins: AvroJava #602

classic Classic list List threaded Threaded
3 messages Options
Reply | Threaded
Open this post in threaded view
|

Build failed in Jenkins: AvroJava #602

Apache Jenkins Server
See <https://builds.apache.org/job/AvroJava/602/display/redirect?page=changes>

Changes:

[dan] [AVRO-2106] Split netty/jetty out of avro-ipc

------------------------------------------
[...truncated 111.66 KB...]
[INFO]
[INFO]
[INFO] --- maven-checkstyle-plugin:3.0.0:check (checkstyle-check) @ avro-compiler ---
[INFO] Starting audit...
Audit done.
[INFO]
[INFO] --- maven-bundle-plugin:4.1.0:bundle (default-bundle) @ avro-compiler ---
[INFO]
[INFO] --- maven-site-plugin:3.0:attach-descriptor (attach-descriptor) @ avro-compiler ---
[INFO]
[INFO] --- maven-install-plugin:2.3.1:install (default-install) @ avro-compiler ---
[INFO] Installing <https://builds.apache.org/job/AvroJava/ws/lang/java/compiler/target/avro-compiler-1.9.0-SNAPSHOT.jar> to /home/jenkins/.m2/repository/org/apache/avro/avro-compiler/1.9.0-SNAPSHOT/avro-compiler-1.9.0-SNAPSHOT.jar
[INFO] Installing <https://builds.apache.org/job/AvroJava/ws/lang/java/compiler/pom.xml> to /home/jenkins/.m2/repository/org/apache/avro/avro-compiler/1.9.0-SNAPSHOT/avro-compiler-1.9.0-SNAPSHOT.pom
[INFO] Installing <https://builds.apache.org/job/AvroJava/ws/lang/java/compiler/target/avro-compiler-1.9.0-SNAPSHOT-sources.jar> to /home/jenkins/.m2/repository/org/apache/avro/avro-compiler/1.9.0-SNAPSHOT/avro-compiler-1.9.0-SNAPSHOT-sources.jar
[INFO]
[INFO] --- maven-bundle-plugin:4.1.0:install (default-install) @ avro-compiler ---
[INFO] Installing org/apache/avro/avro-compiler/1.9.0-SNAPSHOT/avro-compiler-1.9.0-SNAPSHOT.jar
[INFO] Writing OBR metadata
[INFO]
[INFO] --- maven-deploy-plugin:2.6:deploy (default-deploy) @ avro-compiler ---
Downloading from apache.snapshots.https: https://repository.apache.org/content/repositories/snapshots/org/apache/avro/avro-compiler/1.9.0-SNAPSHOT/maven-metadata.xml
Progress (1): 996 B                   Downloaded from apache.snapshots.https: https://repository.apache.org/content/repositories/snapshots/org/apache/avro/avro-compiler/1.9.0-SNAPSHOT/maven-metadata.xml (996 B at 1.6 kB/s)
Uploading to apache.snapshots.https: https://repository.apache.org/content/repositories/snapshots/org/apache/avro/avro-compiler/1.9.0-SNAPSHOT/avro-compiler-1.9.0-20190207.205327-60.jar
Progress (1): 2.0/112 kBProgress (1): 4.1/112 kBProgress (1): 6.1/112 kBProgress (1): 8.2/112 kBProgress (1): 10/112 kB Progress (1): 12/112 kBProgress (1): 14/112 kBProgress (1): 16/112 kBProgress (1): 18/112 kBProgress (1): 20/112 kBProgress (1): 23/112 kBProgress (1): 25/112 kBProgress (1): 27/112 kBProgress (1): 29/112 kBProgress (1): 31/112 kBProgress (1): 33/112 kBProgress (1): 35/112 kBProgress (1): 37/112 kBProgress (1): 39/112 kBProgress (1): 41/112 kBProgress (1): 43/112 kBProgress (1): 45/112 kBProgress (1): 47/112 kBProgress (1): 49/112 kBProgress (1): 51/112 kBProgress (1): 53/112 kBProgress (1): 55/112 kBProgress (1): 57/112 kBProgress (1): 59/112 kBProgress (1): 61/112 kBProgress (1): 63/112 kBProgress (1): 66/112 kBProgress (1): 68/112 kBProgress (1): 70/112 kBProgress (1): 72/112 kBProgress (1): 74/112 kBProgress (1): 76/112 kBProgress (1): 78/112 kBProgress (1): 80/112 kBProgress (1): 82/112 kBProgress (1): 84/112 kBProgress (1): 86/112 kBProgress (1): 88/112 kBProgress (1): 90/112 kBProgress (1): 92/112 kBProgress (1): 94/112 kBProgress (1): 96/112 kBProgress (1): 98/112 kBProgress (1): 100/112 kBProgress (1): 102/112 kBProgress (1): 104/112 kBProgress (1): 106/112 kBProgress (1): 109/112 kBProgress (1): 111/112 kBProgress (1): 112 kB                        Uploaded to apache.snapshots.https: https://repository.apache.org/content/repositories/snapshots/org/apache/avro/avro-compiler/1.9.0-SNAPSHOT/avro-compiler-1.9.0-20190207.205327-60.jar (112 kB at 86 kB/s)
Uploading to apache.snapshots.https: https://repository.apache.org/content/repositories/snapshots/org/apache/avro/avro-compiler/1.9.0-SNAPSHOT/avro-compiler-1.9.0-20190207.205327-60.pom
Progress (1): 2.0/7.3 kBProgress (1): 4.1/7.3 kBProgress (1): 6.1/7.3 kBProgress (1): 7.3 kB                        Uploaded to apache.snapshots.https: https://repository.apache.org/content/repositories/snapshots/org/apache/avro/avro-compiler/1.9.0-SNAPSHOT/avro-compiler-1.9.0-20190207.205327-60.pom (7.3 kB at 6.6 kB/s)
Downloading from apache.snapshots.https: https://repository.apache.org/content/repositories/snapshots/org/apache/avro/avro-compiler/maven-metadata.xml
Progress (1): 348 B                   Downloaded from apache.snapshots.https: https://repository.apache.org/content/repositories/snapshots/org/apache/avro/avro-compiler/maven-metadata.xml (348 B at 567 B/s)
Uploading to apache.snapshots.https: https://repository.apache.org/content/repositories/snapshots/org/apache/avro/avro-compiler/1.9.0-SNAPSHOT/maven-metadata.xml
Progress (1): 996 B                   Uploaded to apache.snapshots.https: https://repository.apache.org/content/repositories/snapshots/org/apache/avro/avro-compiler/1.9.0-SNAPSHOT/maven-metadata.xml (996 B at 882 B/s)
Uploading to apache.snapshots.https: https://repository.apache.org/content/repositories/snapshots/org/apache/avro/avro-compiler/maven-metadata.xml
Progress (1): 348 B                   Uploaded to apache.snapshots.https: https://repository.apache.org/content/repositories/snapshots/org/apache/avro/avro-compiler/maven-metadata.xml (348 B at 306 B/s)
Uploading to apache.snapshots.https: https://repository.apache.org/content/repositories/snapshots/org/apache/avro/avro-compiler/1.9.0-SNAPSHOT/avro-compiler-1.9.0-20190207.205327-60-sources.jar
Progress (1): 2.0/42 kBProgress (1): 4.1/42 kBProgress (1): 6.1/42 kBProgress (1): 8.2/42 kBProgress (1): 10/42 kB Progress (1): 12/42 kBProgress (1): 14/42 kBProgress (1): 16/42 kBProgress (1): 18/42 kBProgress (1): 20/42 kBProgress (1): 23/42 kBProgress (1): 25/42 kBProgress (1): 27/42 kBProgress (1): 29/42 kBProgress (1): 31/42 kBProgress (1): 33/42 kBProgress (1): 35/42 kBProgress (1): 37/42 kBProgress (1): 39/42 kBProgress (1): 41/42 kBProgress (1): 42 kB                      Uploaded to apache.snapshots.https: https://repository.apache.org/content/repositories/snapshots/org/apache/avro/avro-compiler/1.9.0-SNAPSHOT/avro-compiler-1.9.0-20190207.205327-60-sources.jar (42 kB at 35 kB/s)
Uploading to apache.snapshots.https: https://repository.apache.org/content/repositories/snapshots/org/apache/avro/avro-compiler/1.9.0-SNAPSHOT/maven-metadata.xml
Progress (1): 996 B                   Uploaded to apache.snapshots.https: https://repository.apache.org/content/repositories/snapshots/org/apache/avro/avro-compiler/1.9.0-SNAPSHOT/maven-metadata.xml (996 B at 907 B/s)
[INFO]
[INFO] --- maven-bundle-plugin:4.1.0:deploy (default-deploy) @ avro-compiler ---
[INFO] Remote OBR update disabled (enable with -DremoteOBR)
[INFO]
[INFO] -----------------< org.apache.avro:avro-maven-plugin >------------------
[INFO] Building Apache Avro Maven Plugin 1.9.0-SNAPSHOT                  [5/22]
[INFO] ----------------------------[ maven-plugin ]----------------------------
[INFO]
[INFO] --- maven-source-plugin:3.0.1:jar-no-fork (default-cli) @ avro-maven-plugin ---
[INFO]
[INFO] --- maven-plugin-plugin:3.6.0:helpmojo (generated-helpmojo) @ avro-maven-plugin ---
[INFO] Using 'UTF-8' encoding to read mojo source files.
[INFO] java-javadoc mojo extractor found 5 mojo descriptors.
[INFO] java-annotations mojo extractor found 0 mojo descriptor.
[INFO]
[INFO] --- maven-remote-resources-plugin:1.2.1:process (default) @ avro-maven-plugin ---
[INFO]
[INFO] --- maven-resources-plugin:2.5:resources (default-resources) @ avro-maven-plugin ---
[debug] execute contextualize
[INFO] Using 'UTF-8' encoding to copy filtered resources.
[INFO] skip non existing resourceDirectory <https://builds.apache.org/job/AvroJava/ws/lang/java/maven-plugin/src/main/resources>
[INFO] Copying 3 resources
[INFO]
[INFO] --- maven-compiler-plugin:3.8.0:compile (default-compile) @ avro-maven-plugin ---
[INFO] Changes detected - recompiling the module!
[INFO] Compiling 6 source files to <https://builds.apache.org/job/AvroJava/ws/lang/java/maven-plugin/target/classes>
[INFO] <https://builds.apache.org/job/AvroJava/ws/lang/java/maven-plugin/src/main/java/org/apache/avro/mojo/InduceMojo.java>: <https://builds.apache.org/job/AvroJava/ws/lang/java/maven-plugin/src/main/java/org/apache/avro/mojo/InduceMojo.java> uses unchecked or unsafe operations.
[INFO] <https://builds.apache.org/job/AvroJava/ws/lang/java/maven-plugin/src/main/java/org/apache/avro/mojo/InduceMojo.java>: Recompile with -Xlint:unchecked for details.
[INFO]
[INFO] --- maven-plugin-plugin:3.6.0:descriptor (default-descriptor) @ avro-maven-plugin ---
[INFO] Using 'UTF-8' encoding to read mojo source files.
[INFO] java-javadoc mojo extractor found 5 mojo descriptors.
[INFO] java-annotations mojo extractor found 0 mojo descriptor.
[INFO]
[INFO] --- maven-bundle-plugin:4.1.0:manifest (bundle-manifest) @ avro-maven-plugin ---
[WARNING] Ignoring project type maven-plugin - supportedProjectTypes = [bundle]
[INFO]
[INFO] --- maven-resources-plugin:2.5:testResources (default-testResources) @ avro-maven-plugin ---
[debug] execute contextualize
[INFO] Using 'UTF-8' encoding to copy filtered resources.
[INFO] Copying 8 resources
[INFO] Copying 3 resources
[INFO]
[INFO] --- maven-compiler-plugin:3.8.0:testCompile (default-testCompile) @ avro-maven-plugin ---
[INFO] Nothing to compile - all classes are up to date
[INFO]
[INFO] --- maven-surefire-plugin:3.0.0-M3:test (default-test) @ avro-maven-plugin ---
[INFO]
[INFO] -------------------------------------------------------
[INFO]  T E S T S
[INFO] -------------------------------------------------------
[INFO] Running org.apache.avro.mojo.TestIDLProtocolMojo
[INFO] Tests run: 2, Failures: 0, Errors: 0, Skipped: 0, Time elapsed: 1.077 s - in org.apache.avro.mojo.TestIDLProtocolMojo
[INFO] Running org.apache.avro.mojo.TestProtocolMojo
[INFO] Tests run: 2, Failures: 0, Errors: 0, Skipped: 0, Time elapsed: 0.178 s - in org.apache.avro.mojo.TestProtocolMojo
[INFO] Running org.apache.avro.mojo.TestInduceMojo
[INFO] Tests run: 5, Failures: 0, Errors: 0, Skipped: 0, Time elapsed: 0.2 s - in org.apache.avro.mojo.TestInduceMojo
[INFO] Running org.apache.avro.mojo.TestSchemaMojo
[INFO] Tests run: 2, Failures: 0, Errors: 0, Skipped: 0, Time elapsed: 0.21 s - in org.apache.avro.mojo.TestSchemaMojo
[INFO]
[INFO] Results:
[INFO]
[INFO] Tests run: 11, Failures: 0, Errors: 0, Skipped: 0
[INFO]
[INFO]
[INFO] --- maven-checkstyle-plugin:3.0.0:check (checkstyle-check) @ avro-maven-plugin ---
[INFO] Starting audit...
Audit done.
[INFO]
[INFO] --- maven-jar-plugin:3.1.0:jar (default-jar) @ avro-maven-plugin ---
[INFO] Building jar: <https://builds.apache.org/job/AvroJava/ws/lang/java/maven-plugin/target/avro-maven-plugin-1.9.0-SNAPSHOT.jar>
[INFO]
[INFO] --- maven-plugin-plugin:3.6.0:addPluginArtifactMetadata (default-addPluginArtifactMetadata) @ avro-maven-plugin ---
[INFO]
[INFO] --- maven-site-plugin:3.0:attach-descriptor (attach-descriptor) @ avro-maven-plugin ---
[INFO]
[INFO] --- maven-jar-plugin:3.1.0:test-jar (default) @ avro-maven-plugin ---
[INFO] Building jar: <https://builds.apache.org/job/AvroJava/ws/lang/java/maven-plugin/target/avro-maven-plugin-1.9.0-SNAPSHOT-tests.jar>
[INFO]
[INFO] --- maven-install-plugin:2.3.1:install (default-install) @ avro-maven-plugin ---
[INFO] Installing <https://builds.apache.org/job/AvroJava/ws/lang/java/maven-plugin/target/avro-maven-plugin-1.9.0-SNAPSHOT.jar> to /home/jenkins/.m2/repository/org/apache/avro/avro-maven-plugin/1.9.0-SNAPSHOT/avro-maven-plugin-1.9.0-SNAPSHOT.jar
[INFO] Installing <https://builds.apache.org/job/AvroJava/ws/lang/java/maven-plugin/pom.xml> to /home/jenkins/.m2/repository/org/apache/avro/avro-maven-plugin/1.9.0-SNAPSHOT/avro-maven-plugin-1.9.0-SNAPSHOT.pom
[INFO] Installing <https://builds.apache.org/job/AvroJava/ws/lang/java/maven-plugin/target/avro-maven-plugin-1.9.0-SNAPSHOT-sources.jar> to /home/jenkins/.m2/repository/org/apache/avro/avro-maven-plugin/1.9.0-SNAPSHOT/avro-maven-plugin-1.9.0-SNAPSHOT-sources.jar
[INFO] Installing <https://builds.apache.org/job/AvroJava/ws/lang/java/maven-plugin/target/avro-maven-plugin-1.9.0-SNAPSHOT-tests.jar> to /home/jenkins/.m2/repository/org/apache/avro/avro-maven-plugin/1.9.0-SNAPSHOT/avro-maven-plugin-1.9.0-SNAPSHOT-tests.jar
[INFO]
[INFO] --- maven-deploy-plugin:2.6:deploy (default-deploy) @ avro-maven-plugin ---
Downloading from apache.snapshots.https: https://repository.apache.org/content/repositories/snapshots/org/apache/avro/avro-maven-plugin/1.9.0-SNAPSHOT/maven-metadata.xml
Progress (1): 1.2 kB                    Downloaded from apache.snapshots.https: https://repository.apache.org/content/repositories/snapshots/org/apache/avro/avro-maven-plugin/1.9.0-SNAPSHOT/maven-metadata.xml (1.2 kB at 2.0 kB/s)
Uploading to apache.snapshots.https: https://repository.apache.org/content/repositories/snapshots/org/apache/avro/avro-maven-plugin/1.9.0-SNAPSHOT/avro-maven-plugin-1.9.0-20190207.205343-60.jar
Progress (1): 2.0/34 kBProgress (1): 4.1/34 kBProgress (1): 6.1/34 kBProgress (1): 8.2/34 kBProgress (1): 10/34 kB Progress (1): 12/34 kBProgress (1): 14/34 kBProgress (1): 16/34 kBProgress (1): 18/34 kBProgress (1): 20/34 kBProgress (1): 23/34 kBProgress (1): 25/34 kBProgress (1): 27/34 kBProgress (1): 29/34 kBProgress (1): 31/34 kBProgress (1): 33/34 kBProgress (1): 34 kB                      Uploaded to apache.snapshots.https: https://repository.apache.org/content/repositories/snapshots/org/apache/avro/avro-maven-plugin/1.9.0-SNAPSHOT/avro-maven-plugin-1.9.0-20190207.205343-60.jar (34 kB at 29 kB/s)
Uploading to apache.snapshots.https: https://repository.apache.org/content/repositories/snapshots/org/apache/avro/avro-maven-plugin/1.9.0-SNAPSHOT/avro-maven-plugin-1.9.0-20190207.205343-60.pom
Progress (1): 2.0/3.4 kBProgress (1): 3.4 kB                        Uploaded to apache.snapshots.https: https://repository.apache.org/content/repositories/snapshots/org/apache/avro/avro-maven-plugin/1.9.0-SNAPSHOT/avro-maven-plugin-1.9.0-20190207.205343-60.pom (3.4 kB at 3.1 kB/s)
Downloading from apache.snapshots.https: https://repository.apache.org/content/repositories/snapshots/org/apache/avro/avro-maven-plugin/maven-metadata.xml
Progress (1): 352 B                   Downloaded from apache.snapshots.https: https://repository.apache.org/content/repositories/snapshots/org/apache/avro/avro-maven-plugin/maven-metadata.xml (352 B at 582 B/s)
Downloading from apache.snapshots.https: https://repository.apache.org/content/repositories/snapshots/org/apache/avro/maven-metadata.xml
Progress (1): 235 B                   Downloaded from apache.snapshots.https: https://repository.apache.org/content/repositories/snapshots/org/apache/avro/maven-metadata.xml (235 B at 404 B/s)
Uploading to apache.snapshots.https: https://repository.apache.org/content/repositories/snapshots/org/apache/avro/avro-maven-plugin/1.9.0-SNAPSHOT/maven-metadata.xml
Progress (1): 1.2 kB                    Uploaded to apache.snapshots.https: https://repository.apache.org/content/repositories/snapshots/org/apache/avro/avro-maven-plugin/1.9.0-SNAPSHOT/maven-metadata.xml (1.2 kB at 1.1 kB/s)
Uploading to apache.snapshots.https: https://repository.apache.org/content/repositories/snapshots/org/apache/avro/avro-maven-plugin/maven-metadata.xml
Progress (1): 352 B                   Uploaded to apache.snapshots.https: https://repository.apache.org/content/repositories/snapshots/org/apache/avro/avro-maven-plugin/maven-metadata.xml (352 B at 320 B/s)
Uploading to apache.snapshots.https: https://repository.apache.org/content/repositories/snapshots/org/apache/avro/maven-metadata.xml
Progress (1): 235 B                   Uploaded to apache.snapshots.https: https://repository.apache.org/content/repositories/snapshots/org/apache/avro/maven-metadata.xml (235 B at 211 B/s)
Uploading to apache.snapshots.https: https://repository.apache.org/content/repositories/snapshots/org/apache/avro/avro-maven-plugin/1.9.0-SNAPSHOT/avro-maven-plugin-1.9.0-20190207.205343-60-sources.jar
Progress (1): 2.0/13 kBProgress (1): 4.1/13 kBProgress (1): 6.1/13 kBProgress (1): 8.2/13 kBProgress (1): 10/13 kB Progress (1): 12/13 kBProgress (1): 13 kB                      Uploaded to apache.snapshots.https: https://repository.apache.org/content/repositories/snapshots/org/apache/avro/avro-maven-plugin/1.9.0-SNAPSHOT/avro-maven-plugin-1.9.0-20190207.205343-60-sources.jar (13 kB at 11 kB/s)
Uploading to apache.snapshots.https: https://repository.apache.org/content/repositories/snapshots/org/apache/avro/avro-maven-plugin/1.9.0-SNAPSHOT/maven-metadata.xml
Progress (1): 1.2 kB                    Uploaded to apache.snapshots.https: https://repository.apache.org/content/repositories/snapshots/org/apache/avro/avro-maven-plugin/1.9.0-SNAPSHOT/maven-metadata.xml (1.2 kB at 1.1 kB/s)
Uploading to apache.snapshots.https: https://repository.apache.org/content/repositories/snapshots/org/apache/avro/avro-maven-plugin/1.9.0-SNAPSHOT/avro-maven-plugin-1.9.0-20190207.205343-60-tests.jar
Progress (1): 2.0/25 kBProgress (1): 4.1/25 kBProgress (1): 6.1/25 kBProgress (1): 8.2/25 kBProgress (1): 10/25 kB Progress (1): 12/25 kBProgress (1): 14/25 kBProgress (1): 16/25 kBProgress (1): 18/25 kBProgress (1): 20/25 kBProgress (1): 23/25 kBProgress (1): 25/25 kBProgress (1): 25 kB                      Uploaded to apache.snapshots.https: https://repository.apache.org/content/repositories/snapshots/org/apache/avro/avro-maven-plugin/1.9.0-SNAPSHOT/avro-maven-plugin-1.9.0-20190207.205343-60-tests.jar (25 kB at 22 kB/s)
Uploading to apache.snapshots.https: https://repository.apache.org/content/repositories/snapshots/org/apache/avro/avro-maven-plugin/1.9.0-SNAPSHOT/maven-metadata.xml
Progress (1): 1.2 kB                    Uploaded to apache.snapshots.https: https://repository.apache.org/content/repositories/snapshots/org/apache/avro/avro-maven-plugin/1.9.0-SNAPSHOT/maven-metadata.xml (1.2 kB at 1.1 kB/s)
[INFO]
[INFO] ----------------------< org.apache.avro:avro-ipc >----------------------
[INFO] Building Apache Avro IPC 1.9.0-SNAPSHOT                           [6/22]
[INFO] -------------------------------[ bundle ]-------------------------------
[INFO]
[INFO] --- maven-source-plugin:3.0.1:jar-no-fork (default-cli) @ avro-ipc ---
[INFO] Building jar: <https://builds.apache.org/job/AvroJava/ws/lang/java/ipc/target/avro-ipc-1.9.0-SNAPSHOT-sources.jar>
[INFO]
[INFO] --- avro-maven-plugin:1.9.0-SNAPSHOT:schema (schemas) @ avro-ipc ---
[INFO]
[INFO] --- avro-maven-plugin:1.9.0-SNAPSHOT:protocol (schemas) @ avro-ipc ---
[INFO]
[INFO] --- avro-maven-plugin:1.9.0-SNAPSHOT:idl-protocol (schemas) @ avro-ipc ---
[INFO]
[INFO] --- maven-remote-resources-plugin:1.2.1:process (default) @ avro-ipc ---
[INFO]
[INFO] --- maven-resources-plugin:2.5:resources (default-resources) @ avro-ipc ---
[debug] execute contextualize
[INFO] Using 'UTF-8' encoding to copy filtered resources.
[INFO] Copying 9 resources
[INFO] Copying 3 resources
[INFO]
[INFO] --- maven-compiler-plugin:3.8.0:compile (default-compile) @ avro-ipc ---
[INFO] Changes detected - recompiling the module!
[INFO] Compiling 34 source files to <https://builds.apache.org/job/AvroJava/ws/lang/java/ipc/target/classes>
[INFO] <https://builds.apache.org/job/AvroJava/ws/lang/java/ipc/src/main/java/org/apache/avro/ipc/Responder.java>: Some input files use or override a deprecated API.
[INFO] <https://builds.apache.org/job/AvroJava/ws/lang/java/ipc/src/main/java/org/apache/avro/ipc/Responder.java>: Recompile with -Xlint:deprecation for details.
[INFO]
[INFO] --- maven-bundle-plugin:4.1.0:manifest (bundle-manifest) @ avro-ipc ---
[INFO]
[INFO] --- maven-resources-plugin:2.5:testResources (default-testResources) @ avro-ipc ---
[debug] execute contextualize
[INFO] Using 'UTF-8' encoding to copy filtered resources.
[INFO] Copying 1 resource
[INFO] Copying 3 resources
[INFO]
[INFO] --- maven-compiler-plugin:3.8.0:testCompile (default-testCompile) @ avro-ipc ---
[INFO] Changes detected - recompiling the module!
[INFO] Compiling 106 source files to <https://builds.apache.org/job/AvroJava/ws/lang/java/ipc/target/test-classes>
[INFO] <https://builds.apache.org/job/AvroJava/ws/lang/java/ipc/src/test/java/org/apache/avro/TestProtocolReflect.java>: Some input files use or override a deprecated API.
[INFO] <https://builds.apache.org/job/AvroJava/ws/lang/java/ipc/src/test/java/org/apache/avro/TestProtocolReflect.java>: Recompile with -Xlint:deprecation for details.
[INFO] -------------------------------------------------------------
[ERROR] COMPILATION ERROR :
[INFO] -------------------------------------------------------------
[ERROR] <https://builds.apache.org/job/AvroJava/ws/lang/java/ipc/src/test/java/org/apache/avro/TestNamespaceSpecific.java>:[40,17] org.apache.avro.TestNamespaceSpecific.TestImpl is not abstract and does not override abstract method error() in org.apache.avro.test.namespace.TestNamespace
[ERROR] <https://builds.apache.org/job/AvroJava/ws/lang/java/ipc/src/test/java/org/apache/avro/TestNamespaceSpecific.java>:[42,17] error() in org.apache.avro.TestNamespaceSpecific.TestImpl cannot implement error() in org.apache.avro.test.namespace.TestNamespace
  return type void is not compatible with java.lang.Void
[ERROR] <https://builds.apache.org/job/AvroJava/ws/lang/java/ipc/src/test/java/org/apache/avro/TestProtocolSpecific.java>:[66,17] org.apache.avro.TestProtocolSpecific.TestImpl is not abstract and does not override abstract method error() in org.apache.avro.test.Simple
[ERROR] <https://builds.apache.org/job/AvroJava/ws/lang/java/ipc/src/test/java/org/apache/avro/TestProtocolSpecific.java>:[71,17] error() in org.apache.avro.TestProtocolSpecific.TestImpl cannot implement error() in org.apache.avro.test.Simple
  return type void is not compatible with java.lang.Void
[INFO] 4 errors
[INFO] -------------------------------------------------------------
[INFO] ------------------------------------------------------------------------
[INFO] Reactor Summary:
[INFO]
[INFO] Apache Avro Toplevel 1.9.0-SNAPSHOT ................ SUCCESS [ 18.904 s]
[INFO] Apache Avro Java ................................... SUCCESS [  7.219 s]
[INFO] Apache Avro ........................................ SUCCESS [ 49.280 s]
[INFO] Apache Avro Compiler ............................... SUCCESS [ 28.133 s]
[INFO] Apache Avro Maven Plugin ........................... SUCCESS [ 20.169 s]
[INFO] Apache Avro IPC .................................... FAILURE [  6.070 s]
[INFO] Apache Avro IPC Jetty .............................. SKIPPED
[INFO] Apache Avro IPC Netty .............................. SKIPPED
[INFO] Trevni Java ........................................ SKIPPED
[INFO] Trevni Java Core ................................... SKIPPED
[INFO] Apache Avro Mapred API ............................. SKIPPED
[INFO] Trevni Java Avro ................................... SKIPPED
[INFO] Trevni Specification ............................... SKIPPED
[INFO] Apache Avro Tools .................................. SKIPPED
[INFO] Apache Avro Protobuf Compatibility ................. SKIPPED
[INFO] Apache Avro Thrift Compatibility ................... SKIPPED
[INFO] Apache Avro Maven Archetypes ....................... SKIPPED
[INFO] Apache Avro Maven Service Archetype ................ SKIPPED
[INFO] Apache Avro gRPC ................................... SKIPPED
[INFO] Avro Integration Tests ............................. SKIPPED
[INFO] Apache Avro Codegen Test dependencies .............. SKIPPED
[INFO] Apache Avro Codegen Test 1.9.0-SNAPSHOT ............ SKIPPED
[INFO] ------------------------------------------------------------------------
[INFO] BUILD FAILURE
[INFO] ------------------------------------------------------------------------
[INFO] Total time: 02:13 min
[INFO] Finished at: 2019-02-07T20:54:01Z
[INFO] ------------------------------------------------------------------------
[ERROR] Failed to execute goal org.apache.maven.plugins:maven-compiler-plugin:3.8.0:testCompile (default-testCompile) on project avro-ipc: Compilation failure: Compilation failure:
[ERROR] <https://builds.apache.org/job/AvroJava/ws/lang/java/ipc/src/test/java/org/apache/avro/TestNamespaceSpecific.java>:[40,17] org.apache.avro.TestNamespaceSpecific.TestImpl is not abstract and does not override abstract method error() in org.apache.avro.test.namespace.TestNamespace
[ERROR] <https://builds.apache.org/job/AvroJava/ws/lang/java/ipc/src/test/java/org/apache/avro/TestNamespaceSpecific.java>:[42,17] error() in org.apache.avro.TestNamespaceSpecific.TestImpl cannot implement error() in org.apache.avro.test.namespace.TestNamespace
[ERROR]   return type void is not compatible with java.lang.Void
[ERROR] <https://builds.apache.org/job/AvroJava/ws/lang/java/ipc/src/test/java/org/apache/avro/TestProtocolSpecific.java>:[66,17] org.apache.avro.TestProtocolSpecific.TestImpl is not abstract and does not override abstract method error() in org.apache.avro.test.Simple
[ERROR] <https://builds.apache.org/job/AvroJava/ws/lang/java/ipc/src/test/java/org/apache/avro/TestProtocolSpecific.java>:[71,17] error() in org.apache.avro.TestProtocolSpecific.TestImpl cannot implement error() in org.apache.avro.test.Simple
[ERROR]   return type void is not compatible with java.lang.Void
[ERROR] -> [Help 1]
[ERROR]
[ERROR] To see the full stack trace of the errors, re-run Maven with the -e switch.
[ERROR] Re-run Maven using the -X switch to enable full debug logging.
[ERROR]
[ERROR] For more information about the errors and possible solutions, please read the following articles:
[ERROR] [Help 1] http://cwiki.apache.org/confluence/display/MAVEN/MojoFailureException
[ERROR]
[ERROR] After correcting the problems, you can resume the build with the command
[ERROR]   mvn <goals> -rf :avro-ipc
Build step 'Invoke top-level Maven targets' marked build as failure
Recording test results
[JIRA] Updating issue AVRO-2106
Reply | Threaded
Open this post in threaded view
|

Build failed in Jenkins: AvroJava #603

Apache Jenkins Server
See <https://builds.apache.org/job/AvroJava/603/display/redirect?page=changes>

Changes:

[dan] AVRO-2302 Fix invalid namespace on BigQuery import

------------------------------------------
[...truncated 69.88 KB...]
[INFO] Tests run: 63, Failures: 0, Errors: 0, Skipped: 0
[INFO]
[INFO]
[INFO] --- maven-checkstyle-plugin:3.0.0:check (checkstyle-check) @ avro-compiler ---
[INFO] Starting audit...
Audit done.
[INFO]
[INFO] --- maven-bundle-plugin:4.1.0:bundle (default-bundle) @ avro-compiler ---
[INFO]
[INFO] --- maven-site-plugin:3.0:attach-descriptor (attach-descriptor) @ avro-compiler ---
[INFO]
[INFO] --- maven-install-plugin:2.3.1:install (default-install) @ avro-compiler ---
[INFO] Installing <https://builds.apache.org/job/AvroJava/ws/lang/java/compiler/target/avro-compiler-1.9.0-SNAPSHOT.jar> to /home/jenkins/.m2/repository/org/apache/avro/avro-compiler/1.9.0-SNAPSHOT/avro-compiler-1.9.0-SNAPSHOT.jar
[INFO] Installing <https://builds.apache.org/job/AvroJava/ws/lang/java/compiler/pom.xml> to /home/jenkins/.m2/repository/org/apache/avro/avro-compiler/1.9.0-SNAPSHOT/avro-compiler-1.9.0-SNAPSHOT.pom
[INFO] Installing <https://builds.apache.org/job/AvroJava/ws/lang/java/compiler/target/avro-compiler-1.9.0-SNAPSHOT-sources.jar> to /home/jenkins/.m2/repository/org/apache/avro/avro-compiler/1.9.0-SNAPSHOT/avro-compiler-1.9.0-SNAPSHOT-sources.jar
[INFO]
[INFO] --- maven-bundle-plugin:4.1.0:install (default-install) @ avro-compiler ---
[INFO] Installing org/apache/avro/avro-compiler/1.9.0-SNAPSHOT/avro-compiler-1.9.0-SNAPSHOT.jar
[INFO] Writing OBR metadata
[INFO]
[INFO] --- maven-deploy-plugin:2.6:deploy (default-deploy) @ avro-compiler ---
Downloading from apache.snapshots.https: https://repository.apache.org/content/repositories/snapshots/org/apache/avro/avro-compiler/1.9.0-SNAPSHOT/maven-metadata.xml
Progress (1): 996 B                   Downloaded from apache.snapshots.https: https://repository.apache.org/content/repositories/snapshots/org/apache/avro/avro-compiler/1.9.0-SNAPSHOT/maven-metadata.xml (996 B at 1.7 kB/s)
Uploading to apache.snapshots.https: https://repository.apache.org/content/repositories/snapshots/org/apache/avro/avro-compiler/1.9.0-SNAPSHOT/avro-compiler-1.9.0-20190207.214319-61.jar
Progress (1): 2.0/112 kBProgress (1): 4.1/112 kBProgress (1): 6.1/112 kBProgress (1): 8.2/112 kBProgress (1): 10/112 kB Progress (1): 12/112 kBProgress (1): 14/112 kBProgress (1): 16/112 kBProgress (1): 18/112 kBProgress (1): 20/112 kBProgress (1): 23/112 kBProgress (1): 25/112 kBProgress (1): 27/112 kBProgress (1): 29/112 kBProgress (1): 31/112 kBProgress (1): 33/112 kBProgress (1): 35/112 kBProgress (1): 37/112 kBProgress (1): 39/112 kBProgress (1): 41/112 kBProgress (1): 43/112 kBProgress (1): 45/112 kBProgress (1): 47/112 kBProgress (1): 49/112 kBProgress (1): 51/112 kBProgress (1): 53/112 kBProgress (1): 55/112 kBProgress (1): 57/112 kBProgress (1): 59/112 kBProgress (1): 61/112 kBProgress (1): 63/112 kBProgress (1): 66/112 kBProgress (1): 68/112 kBProgress (1): 70/112 kBProgress (1): 72/112 kBProgress (1): 74/112 kBProgress (1): 76/112 kBProgress (1): 78/112 kBProgress (1): 80/112 kBProgress (1): 82/112 kBProgress (1): 84/112 kBProgress (1): 86/112 kBProgress (1): 88/112 kBProgress (1): 90/112 kBProgress (1): 92/112 kBProgress (1): 94/112 kBProgress (1): 96/112 kBProgress (1): 98/112 kBProgress (1): 100/112 kBProgress (1): 102/112 kBProgress (1): 104/112 kBProgress (1): 106/112 kBProgress (1): 109/112 kBProgress (1): 111/112 kBProgress (1): 112 kB                        Uploaded to apache.snapshots.https: https://repository.apache.org/content/repositories/snapshots/org/apache/avro/avro-compiler/1.9.0-SNAPSHOT/avro-compiler-1.9.0-20190207.214319-61.jar (112 kB at 83 kB/s)
Uploading to apache.snapshots.https: https://repository.apache.org/content/repositories/snapshots/org/apache/avro/avro-compiler/1.9.0-SNAPSHOT/avro-compiler-1.9.0-20190207.214319-61.pom
Progress (1): 2.0/7.3 kBProgress (1): 4.1/7.3 kBProgress (1): 6.1/7.3 kBProgress (1): 7.3 kB                        Uploaded to apache.snapshots.https: https://repository.apache.org/content/repositories/snapshots/org/apache/avro/avro-compiler/1.9.0-SNAPSHOT/avro-compiler-1.9.0-20190207.214319-61.pom (7.3 kB at 6.5 kB/s)
Downloading from apache.snapshots.https: https://repository.apache.org/content/repositories/snapshots/org/apache/avro/avro-compiler/maven-metadata.xml
Progress (1): 348 B                   Downloaded from apache.snapshots.https: https://repository.apache.org/content/repositories/snapshots/org/apache/avro/avro-compiler/maven-metadata.xml (348 B at 567 B/s)
Uploading to apache.snapshots.https: https://repository.apache.org/content/repositories/snapshots/org/apache/avro/avro-compiler/1.9.0-SNAPSHOT/maven-metadata.xml
Progress (1): 996 B                   Uploaded to apache.snapshots.https: https://repository.apache.org/content/repositories/snapshots/org/apache/avro/avro-compiler/1.9.0-SNAPSHOT/maven-metadata.xml (996 B at 878 B/s)
Uploading to apache.snapshots.https: https://repository.apache.org/content/repositories/snapshots/org/apache/avro/avro-compiler/maven-metadata.xml
Progress (1): 348 B                   Uploaded to apache.snapshots.https: https://repository.apache.org/content/repositories/snapshots/org/apache/avro/avro-compiler/maven-metadata.xml (348 B at 312 B/s)
Uploading to apache.snapshots.https: https://repository.apache.org/content/repositories/snapshots/org/apache/avro/avro-compiler/1.9.0-SNAPSHOT/avro-compiler-1.9.0-20190207.214319-61-sources.jar
Progress (1): 2.0/42 kBProgress (1): 4.1/42 kBProgress (1): 6.1/42 kBProgress (1): 8.2/42 kBProgress (1): 10/42 kB Progress (1): 12/42 kBProgress (1): 14/42 kBProgress (1): 16/42 kBProgress (1): 18/42 kBProgress (1): 20/42 kBProgress (1): 23/42 kBProgress (1): 25/42 kBProgress (1): 27/42 kBProgress (1): 29/42 kBProgress (1): 31/42 kBProgress (1): 33/42 kBProgress (1): 35/42 kBProgress (1): 37/42 kBProgress (1): 39/42 kBProgress (1): 41/42 kBProgress (1): 42 kB                      Uploaded to apache.snapshots.https: https://repository.apache.org/content/repositories/snapshots/org/apache/avro/avro-compiler/1.9.0-SNAPSHOT/avro-compiler-1.9.0-20190207.214319-61-sources.jar (42 kB at 34 kB/s)
Uploading to apache.snapshots.https: https://repository.apache.org/content/repositories/snapshots/org/apache/avro/avro-compiler/1.9.0-SNAPSHOT/maven-metadata.xml
Progress (1): 996 B                   Uploaded to apache.snapshots.https: https://repository.apache.org/content/repositories/snapshots/org/apache/avro/avro-compiler/1.9.0-SNAPSHOT/maven-metadata.xml (996 B at 899 B/s)
[INFO]
[INFO] --- maven-bundle-plugin:4.1.0:deploy (default-deploy) @ avro-compiler ---
[INFO] Remote OBR update disabled (enable with -DremoteOBR)
[INFO]
[INFO] -----------------< org.apache.avro:avro-maven-plugin >------------------
[INFO] Building Apache Avro Maven Plugin 1.9.0-SNAPSHOT                  [5/22]
[INFO] ----------------------------[ maven-plugin ]----------------------------
[INFO]
[INFO] --- maven-source-plugin:3.0.1:jar-no-fork (default-cli) @ avro-maven-plugin ---
[INFO]
[INFO] --- maven-plugin-plugin:3.6.0:helpmojo (generated-helpmojo) @ avro-maven-plugin ---
[INFO] Using 'UTF-8' encoding to read mojo source files.
[INFO] java-javadoc mojo extractor found 5 mojo descriptors.
[INFO] java-annotations mojo extractor found 0 mojo descriptor.
[INFO]
[INFO] --- maven-remote-resources-plugin:1.2.1:process (default) @ avro-maven-plugin ---
[INFO]
[INFO] --- maven-resources-plugin:2.5:resources (default-resources) @ avro-maven-plugin ---
[debug] execute contextualize
[INFO] Using 'UTF-8' encoding to copy filtered resources.
[INFO] skip non existing resourceDirectory <https://builds.apache.org/job/AvroJava/ws/lang/java/maven-plugin/src/main/resources>
[INFO] Copying 3 resources
[INFO]
[INFO] --- maven-compiler-plugin:3.8.0:compile (default-compile) @ avro-maven-plugin ---
[INFO] Changes detected - recompiling the module!
[INFO] Compiling 6 source files to <https://builds.apache.org/job/AvroJava/ws/lang/java/maven-plugin/target/classes>
[INFO] <https://builds.apache.org/job/AvroJava/ws/lang/java/maven-plugin/src/main/java/org/apache/avro/mojo/InduceMojo.java>: <https://builds.apache.org/job/AvroJava/ws/lang/java/maven-plugin/src/main/java/org/apache/avro/mojo/InduceMojo.java> uses unchecked or unsafe operations.
[INFO] <https://builds.apache.org/job/AvroJava/ws/lang/java/maven-plugin/src/main/java/org/apache/avro/mojo/InduceMojo.java>: Recompile with -Xlint:unchecked for details.
[INFO]
[INFO] --- maven-plugin-plugin:3.6.0:descriptor (default-descriptor) @ avro-maven-plugin ---
[INFO] Using 'UTF-8' encoding to read mojo source files.
[INFO] java-javadoc mojo extractor found 5 mojo descriptors.
[INFO] java-annotations mojo extractor found 0 mojo descriptor.
[INFO]
[INFO] --- maven-bundle-plugin:4.1.0:manifest (bundle-manifest) @ avro-maven-plugin ---
[WARNING] Ignoring project type maven-plugin - supportedProjectTypes = [bundle]
[INFO]
[INFO] --- maven-resources-plugin:2.5:testResources (default-testResources) @ avro-maven-plugin ---
[debug] execute contextualize
[INFO] Using 'UTF-8' encoding to copy filtered resources.
[INFO] Copying 8 resources
[INFO] Copying 3 resources
[INFO]
[INFO] --- maven-compiler-plugin:3.8.0:testCompile (default-testCompile) @ avro-maven-plugin ---
[INFO] Nothing to compile - all classes are up to date
[INFO]
[INFO] --- maven-surefire-plugin:3.0.0-M3:test (default-test) @ avro-maven-plugin ---
[INFO]
[INFO] -------------------------------------------------------
[INFO]  T E S T S
[INFO] -------------------------------------------------------
[INFO] Running org.apache.avro.mojo.TestIDLProtocolMojo
[INFO] Tests run: 2, Failures: 0, Errors: 0, Skipped: 0, Time elapsed: 1.095 s - in org.apache.avro.mojo.TestIDLProtocolMojo
[INFO] Running org.apache.avro.mojo.TestProtocolMojo
[INFO] Tests run: 2, Failures: 0, Errors: 0, Skipped: 0, Time elapsed: 0.158 s - in org.apache.avro.mojo.TestProtocolMojo
[INFO] Running org.apache.avro.mojo.TestSchemaMojo
[INFO] Tests run: 2, Failures: 0, Errors: 0, Skipped: 0, Time elapsed: 0.185 s - in org.apache.avro.mojo.TestSchemaMojo
[INFO] Running org.apache.avro.mojo.TestInduceMojo
[INFO] Tests run: 5, Failures: 0, Errors: 0, Skipped: 0, Time elapsed: 0.175 s - in org.apache.avro.mojo.TestInduceMojo
[INFO]
[INFO] Results:
[INFO]
[INFO] Tests run: 11, Failures: 0, Errors: 0, Skipped: 0
[INFO]
[INFO]
[INFO] --- maven-checkstyle-plugin:3.0.0:check (checkstyle-check) @ avro-maven-plugin ---
[INFO] Starting audit...
Audit done.
[INFO]
[INFO] --- maven-jar-plugin:3.1.0:jar (default-jar) @ avro-maven-plugin ---
[INFO] Building jar: <https://builds.apache.org/job/AvroJava/ws/lang/java/maven-plugin/target/avro-maven-plugin-1.9.0-SNAPSHOT.jar>
[INFO]
[INFO] --- maven-plugin-plugin:3.6.0:addPluginArtifactMetadata (default-addPluginArtifactMetadata) @ avro-maven-plugin ---
[INFO]
[INFO] --- maven-site-plugin:3.0:attach-descriptor (attach-descriptor) @ avro-maven-plugin ---
[INFO]
[INFO] --- maven-jar-plugin:3.1.0:test-jar (default) @ avro-maven-plugin ---
[INFO] Building jar: <https://builds.apache.org/job/AvroJava/ws/lang/java/maven-plugin/target/avro-maven-plugin-1.9.0-SNAPSHOT-tests.jar>
[INFO]
[INFO] --- maven-install-plugin:2.3.1:install (default-install) @ avro-maven-plugin ---
[INFO] Installing <https://builds.apache.org/job/AvroJava/ws/lang/java/maven-plugin/target/avro-maven-plugin-1.9.0-SNAPSHOT.jar> to /home/jenkins/.m2/repository/org/apache/avro/avro-maven-plugin/1.9.0-SNAPSHOT/avro-maven-plugin-1.9.0-SNAPSHOT.jar
[INFO] Installing <https://builds.apache.org/job/AvroJava/ws/lang/java/maven-plugin/pom.xml> to /home/jenkins/.m2/repository/org/apache/avro/avro-maven-plugin/1.9.0-SNAPSHOT/avro-maven-plugin-1.9.0-SNAPSHOT.pom
[INFO] Installing <https://builds.apache.org/job/AvroJava/ws/lang/java/maven-plugin/target/avro-maven-plugin-1.9.0-SNAPSHOT-sources.jar> to /home/jenkins/.m2/repository/org/apache/avro/avro-maven-plugin/1.9.0-SNAPSHOT/avro-maven-plugin-1.9.0-SNAPSHOT-sources.jar
[INFO] Installing <https://builds.apache.org/job/AvroJava/ws/lang/java/maven-plugin/target/avro-maven-plugin-1.9.0-SNAPSHOT-tests.jar> to /home/jenkins/.m2/repository/org/apache/avro/avro-maven-plugin/1.9.0-SNAPSHOT/avro-maven-plugin-1.9.0-SNAPSHOT-tests.jar
[INFO]
[INFO] --- maven-deploy-plugin:2.6:deploy (default-deploy) @ avro-maven-plugin ---
Downloading from apache.snapshots.https: https://repository.apache.org/content/repositories/snapshots/org/apache/avro/avro-maven-plugin/1.9.0-SNAPSHOT/maven-metadata.xml
Progress (1): 1.2 kB                    Downloaded from apache.snapshots.https: https://repository.apache.org/content/repositories/snapshots/org/apache/avro/avro-maven-plugin/1.9.0-SNAPSHOT/maven-metadata.xml (1.2 kB at 2.0 kB/s)
Uploading to apache.snapshots.https: https://repository.apache.org/content/repositories/snapshots/org/apache/avro/avro-maven-plugin/1.9.0-SNAPSHOT/avro-maven-plugin-1.9.0-20190207.214333-61.jar
Progress (1): 2.0/34 kBProgress (1): 4.1/34 kBProgress (1): 6.1/34 kBProgress (1): 8.2/34 kBProgress (1): 10/34 kB Progress (1): 12/34 kBProgress (1): 14/34 kBProgress (1): 16/34 kBProgress (1): 18/34 kBProgress (1): 20/34 kBProgress (1): 23/34 kBProgress (1): 25/34 kBProgress (1): 27/34 kBProgress (1): 29/34 kBProgress (1): 31/34 kBProgress (1): 33/34 kBProgress (1): 34 kB                      Uploaded to apache.snapshots.https: https://repository.apache.org/content/repositories/snapshots/org/apache/avro/avro-maven-plugin/1.9.0-SNAPSHOT/avro-maven-plugin-1.9.0-20190207.214333-61.jar (34 kB at 29 kB/s)
Uploading to apache.snapshots.https: https://repository.apache.org/content/repositories/snapshots/org/apache/avro/avro-maven-plugin/1.9.0-SNAPSHOT/avro-maven-plugin-1.9.0-20190207.214333-61.pom
Progress (1): 2.0/3.4 kBProgress (1): 3.4 kB                        Uploaded to apache.snapshots.https: https://repository.apache.org/content/repositories/snapshots/org/apache/avro/avro-maven-plugin/1.9.0-SNAPSHOT/avro-maven-plugin-1.9.0-20190207.214333-61.pom (3.4 kB at 3.1 kB/s)
Downloading from apache.snapshots.https: https://repository.apache.org/content/repositories/snapshots/org/apache/avro/avro-maven-plugin/maven-metadata.xml
Progress (1): 352 B                   Downloaded from apache.snapshots.https: https://repository.apache.org/content/repositories/snapshots/org/apache/avro/avro-maven-plugin/maven-metadata.xml (352 B at 592 B/s)
Downloading from apache.snapshots.https: https://repository.apache.org/content/repositories/snapshots/org/apache/avro/maven-metadata.xml
Progress (1): 235 B                   Downloaded from apache.snapshots.https: https://repository.apache.org/content/repositories/snapshots/org/apache/avro/maven-metadata.xml (235 B at 392 B/s)
Uploading to apache.snapshots.https: https://repository.apache.org/content/repositories/snapshots/org/apache/avro/avro-maven-plugin/1.9.0-SNAPSHOT/maven-metadata.xml
Progress (1): 1.2 kB                    Uploaded to apache.snapshots.https: https://repository.apache.org/content/repositories/snapshots/org/apache/avro/avro-maven-plugin/1.9.0-SNAPSHOT/maven-metadata.xml (1.2 kB at 1.1 kB/s)
Uploading to apache.snapshots.https: https://repository.apache.org/content/repositories/snapshots/org/apache/avro/avro-maven-plugin/maven-metadata.xml
Progress (1): 352 B                   Uploaded to apache.snapshots.https: https://repository.apache.org/content/repositories/snapshots/org/apache/avro/avro-maven-plugin/maven-metadata.xml (352 B at 326 B/s)
Uploading to apache.snapshots.https: https://repository.apache.org/content/repositories/snapshots/org/apache/avro/maven-metadata.xml
Progress (1): 235 B                   Uploaded to apache.snapshots.https: https://repository.apache.org/content/repositories/snapshots/org/apache/avro/maven-metadata.xml (235 B at 207 B/s)
Uploading to apache.snapshots.https: https://repository.apache.org/content/repositories/snapshots/org/apache/avro/avro-maven-plugin/1.9.0-SNAPSHOT/avro-maven-plugin-1.9.0-20190207.214333-61-sources.jar
Progress (1): 2.0/13 kBProgress (1): 4.1/13 kBProgress (1): 6.1/13 kBProgress (1): 8.2/13 kBProgress (1): 10/13 kB Progress (1): 12/13 kBProgress (1): 13 kB                      Uploaded to apache.snapshots.https: https://repository.apache.org/content/repositories/snapshots/org/apache/avro/avro-maven-plugin/1.9.0-SNAPSHOT/avro-maven-plugin-1.9.0-20190207.214333-61-sources.jar (13 kB at 12 kB/s)
Uploading to apache.snapshots.https: https://repository.apache.org/content/repositories/snapshots/org/apache/avro/avro-maven-plugin/1.9.0-SNAPSHOT/maven-metadata.xml
Progress (1): 1.2 kB                    Uploaded to apache.snapshots.https: https://repository.apache.org/content/repositories/snapshots/org/apache/avro/avro-maven-plugin/1.9.0-SNAPSHOT/maven-metadata.xml (1.2 kB at 1.1 kB/s)
Uploading to apache.snapshots.https: https://repository.apache.org/content/repositories/snapshots/org/apache/avro/avro-maven-plugin/1.9.0-SNAPSHOT/avro-maven-plugin-1.9.0-20190207.214333-61-tests.jar
Progress (1): 2.0/25 kBProgress (1): 4.1/25 kBProgress (1): 6.1/25 kBProgress (1): 8.2/25 kBProgress (1): 10/25 kB Progress (1): 12/25 kBProgress (1): 14/25 kBProgress (1): 16/25 kBProgress (1): 18/25 kBProgress (1): 20/25 kBProgress (1): 23/25 kBProgress (1): 25/25 kBProgress (1): 25 kB                      Uploaded to apache.snapshots.https: https://repository.apache.org/content/repositories/snapshots/org/apache/avro/avro-maven-plugin/1.9.0-SNAPSHOT/avro-maven-plugin-1.9.0-20190207.214333-61-tests.jar (25 kB at 21 kB/s)
Uploading to apache.snapshots.https: https://repository.apache.org/content/repositories/snapshots/org/apache/avro/avro-maven-plugin/1.9.0-SNAPSHOT/maven-metadata.xml
Progress (1): 1.2 kB                    Uploaded to apache.snapshots.https: https://repository.apache.org/content/repositories/snapshots/org/apache/avro/avro-maven-plugin/1.9.0-SNAPSHOT/maven-metadata.xml (1.2 kB at 1.1 kB/s)
[INFO]
[INFO] ----------------------< org.apache.avro:avro-ipc >----------------------
[INFO] Building Apache Avro IPC 1.9.0-SNAPSHOT                           [6/22]
[INFO] -------------------------------[ bundle ]-------------------------------
[INFO]
[INFO] --- maven-source-plugin:3.0.1:jar-no-fork (default-cli) @ avro-ipc ---
[INFO]
[INFO] --- avro-maven-plugin:1.9.0-SNAPSHOT:schema (schemas) @ avro-ipc ---
[INFO]
[INFO] --- avro-maven-plugin:1.9.0-SNAPSHOT:protocol (schemas) @ avro-ipc ---
[INFO]
[INFO] --- avro-maven-plugin:1.9.0-SNAPSHOT:idl-protocol (schemas) @ avro-ipc ---
[INFO]
[INFO] --- maven-remote-resources-plugin:1.2.1:process (default) @ avro-ipc ---
[INFO]
[INFO] --- maven-resources-plugin:2.5:resources (default-resources) @ avro-ipc ---
[debug] execute contextualize
[INFO] Using 'UTF-8' encoding to copy filtered resources.
[INFO] Copying 9 resources
[INFO] Copying 3 resources
[INFO]
[INFO] --- maven-compiler-plugin:3.8.0:compile (default-compile) @ avro-ipc ---
[INFO] Changes detected - recompiling the module!
[INFO] Compiling 34 source files to <https://builds.apache.org/job/AvroJava/ws/lang/java/ipc/target/classes>
[INFO] <https://builds.apache.org/job/AvroJava/ws/lang/java/ipc/src/main/java/org/apache/avro/ipc/Responder.java>: Some input files use or override a deprecated API.
[INFO] <https://builds.apache.org/job/AvroJava/ws/lang/java/ipc/src/main/java/org/apache/avro/ipc/Responder.java>: Recompile with -Xlint:deprecation for details.
[INFO]
[INFO] --- maven-bundle-plugin:4.1.0:manifest (bundle-manifest) @ avro-ipc ---
[INFO]
[INFO] --- maven-resources-plugin:2.5:testResources (default-testResources) @ avro-ipc ---
[debug] execute contextualize
[INFO] Using 'UTF-8' encoding to copy filtered resources.
[INFO] Copying 1 resource
[INFO] Copying 3 resources
[INFO]
[INFO] --- maven-compiler-plugin:3.8.0:testCompile (default-testCompile) @ avro-ipc ---
[INFO] Changes detected - recompiling the module!
[INFO] Compiling 106 source files to <https://builds.apache.org/job/AvroJava/ws/lang/java/ipc/target/test-classes>
[INFO] <https://builds.apache.org/job/AvroJava/ws/lang/java/ipc/src/test/java/org/apache/avro/TestProtocolReflect.java>: Some input files use or override a deprecated API.
[INFO] <https://builds.apache.org/job/AvroJava/ws/lang/java/ipc/src/test/java/org/apache/avro/TestProtocolReflect.java>: Recompile with -Xlint:deprecation for details.
[INFO] -------------------------------------------------------------
[ERROR] COMPILATION ERROR :
[INFO] -------------------------------------------------------------
[ERROR] <https://builds.apache.org/job/AvroJava/ws/lang/java/ipc/src/test/java/org/apache/avro/TestNamespaceSpecific.java>:[40,17] org.apache.avro.TestNamespaceSpecific.TestImpl is not abstract and does not override abstract method error() in org.apache.avro.test.namespace.TestNamespace
[ERROR] <https://builds.apache.org/job/AvroJava/ws/lang/java/ipc/src/test/java/org/apache/avro/TestNamespaceSpecific.java>:[42,17] error() in org.apache.avro.TestNamespaceSpecific.TestImpl cannot implement error() in org.apache.avro.test.namespace.TestNamespace
  return type void is not compatible with java.lang.Void
[ERROR] <https://builds.apache.org/job/AvroJava/ws/lang/java/ipc/src/test/java/org/apache/avro/TestProtocolSpecific.java>:[66,17] org.apache.avro.TestProtocolSpecific.TestImpl is not abstract and does not override abstract method error() in org.apache.avro.test.Simple
[ERROR] <https://builds.apache.org/job/AvroJava/ws/lang/java/ipc/src/test/java/org/apache/avro/TestProtocolSpecific.java>:[71,17] error() in org.apache.avro.TestProtocolSpecific.TestImpl cannot implement error() in org.apache.avro.test.Simple
  return type void is not compatible with java.lang.Void
[INFO] 4 errors
[INFO] -------------------------------------------------------------
[INFO] ------------------------------------------------------------------------
[INFO] Reactor Summary:
[INFO]
[INFO] Apache Avro Toplevel 1.9.0-SNAPSHOT ................ SUCCESS [  7.447 s]
[INFO] Apache Avro Java ................................... SUCCESS [  6.433 s]
[INFO] Apache Avro ........................................ SUCCESS [ 44.477 s]
[INFO] Apache Avro Compiler ............................... SUCCESS [ 25.493 s]
[INFO] Apache Avro Maven Plugin ........................... SUCCESS [ 18.412 s]
[INFO] Apache Avro IPC .................................... FAILURE [  5.863 s]
[INFO] Apache Avro IPC Jetty .............................. SKIPPED
[INFO] Apache Avro IPC Netty .............................. SKIPPED
[INFO] Trevni Java ........................................ SKIPPED
[INFO] Trevni Java Core ................................... SKIPPED
[INFO] Apache Avro Mapred API ............................. SKIPPED
[INFO] Trevni Java Avro ................................... SKIPPED
[INFO] Trevni Specification ............................... SKIPPED
[INFO] Apache Avro Tools .................................. SKIPPED
[INFO] Apache Avro Protobuf Compatibility ................. SKIPPED
[INFO] Apache Avro Thrift Compatibility ................... SKIPPED
[INFO] Apache Avro Maven Archetypes ....................... SKIPPED
[INFO] Apache Avro Maven Service Archetype ................ SKIPPED
[INFO] Apache Avro gRPC ................................... SKIPPED
[INFO] Avro Integration Tests ............................. SKIPPED
[INFO] Apache Avro Codegen Test dependencies .............. SKIPPED
[INFO] Apache Avro Codegen Test 1.9.0-SNAPSHOT ............ SKIPPED
[INFO] ------------------------------------------------------------------------
[INFO] BUILD FAILURE
[INFO] ------------------------------------------------------------------------
[INFO] Total time: 01:49 min
[INFO] Finished at: 2019-02-07T21:43:51Z
[INFO] ------------------------------------------------------------------------
[ERROR] Failed to execute goal org.apache.maven.plugins:maven-compiler-plugin:3.8.0:testCompile (default-testCompile) on project avro-ipc: Compilation failure: Compilation failure:
[ERROR] <https://builds.apache.org/job/AvroJava/ws/lang/java/ipc/src/test/java/org/apache/avro/TestNamespaceSpecific.java>:[40,17] org.apache.avro.TestNamespaceSpecific.TestImpl is not abstract and does not override abstract method error() in org.apache.avro.test.namespace.TestNamespace
[ERROR] <https://builds.apache.org/job/AvroJava/ws/lang/java/ipc/src/test/java/org/apache/avro/TestNamespaceSpecific.java>:[42,17] error() in org.apache.avro.TestNamespaceSpecific.TestImpl cannot implement error() in org.apache.avro.test.namespace.TestNamespace
[ERROR]   return type void is not compatible with java.lang.Void
[ERROR] <https://builds.apache.org/job/AvroJava/ws/lang/java/ipc/src/test/java/org/apache/avro/TestProtocolSpecific.java>:[66,17] org.apache.avro.TestProtocolSpecific.TestImpl is not abstract and does not override abstract method error() in org.apache.avro.test.Simple
[ERROR] <https://builds.apache.org/job/AvroJava/ws/lang/java/ipc/src/test/java/org/apache/avro/TestProtocolSpecific.java>:[71,17] error() in org.apache.avro.TestProtocolSpecific.TestImpl cannot implement error() in org.apache.avro.test.Simple
[ERROR]   return type void is not compatible with java.lang.Void
[ERROR] -> [Help 1]
[ERROR]
[ERROR] To see the full stack trace of the errors, re-run Maven with the -e switch.
[ERROR] Re-run Maven using the -X switch to enable full debug logging.
[ERROR]
[ERROR] For more information about the errors and possible solutions, please read the following articles:
[ERROR] [Help 1] http://cwiki.apache.org/confluence/display/MAVEN/MojoFailureException
[ERROR]
[ERROR] After correcting the problems, you can resume the build with the command
[ERROR]   mvn <goals> -rf :avro-ipc
Build step 'Invoke top-level Maven targets' marked build as failure
Recording test results
[JIRA] Updating issue AVRO-2302
Reply | Threaded
Open this post in threaded view
|

Jenkins build is back to normal : AvroJava #604

Apache Jenkins Server